2.1.35 compile fails due to assembler error

Jauder Ho (jauderho@netcom.com)
Sat, 26 Apr 1997 14:40:46 -0700 (PDT)

2.1.36 fails with this message... any ideas/comments/suggestions?

make[2]: Entering directory `/usr/src/linux-2.1.36/arch/i386/lib'
gcc -D__KERNEL__ -I/usr/src/linux/include -Wall -Wstrict-prototypes -O3
-fomit-frame-pointer -pipe -fno-strength-reduce -m486 -malign-loops=2
-malign-jumps=2 -malign-functions=2 -DCPU=586 -c -o checksum.o checksum.c
{standard input}: Assembler messages:
{standard input}:488: Fatal error: Symbol end_of_body already defined.
make[2]: *** [checksum.o] Error 1
make[2]: Leaving directory `/usr/src/linux-2.1.36/arch/i386/lib'
make[1]: *** [first_rule] Error 2
make[1]: Leaving directory `/usr/src/linux-2.1.36/arch/i386/lib'
make: *** [linuxsubdirs] Error 2

.sig under construction