Re: [PATCH v1] perf pmu: Fix aarch64 build

From: Arnaldo Carvalho de Melo
Date: Fri Feb 03 2023 - 11:02:10 EST


Em Fri, Feb 03, 2023 at 12:43:48PM -0300, Arnaldo Carvalho de Melo escreveu:
> I tried bisecting, but at this cset:
>
> acme@roc-rk3399-pc:~/git/perf$ git log --oneline -1
> d22e569cd33d (HEAD) perf pmu-events: Separate the metrics from events for no jevents
> acme@roc-rk3399-pc:~/git/perf$
>
> I'm getting this:
>
> CC /tmp/build/perf/pmu-events/pmu-events.o
> pmu-events/pmu-events.c:3637:32: error: no previous prototype for ‘perf_pmu__find_table’ [-Werror=missing-prototypes]
> 3637 | const struct pmu_events_table *perf_pmu__find_table(struct perf_pmu *pmu)
> | ^~~~~~~~~~~~~~~~~~~~
> CC /tmp/build/perf/builtin-ftrace.o
> CC /tmp/build/perf/builtin-help.o
> CC /tmp/build/perf/builtin-buildid-list.o
> cc1: all warnings being treated as errors
> make[3]: *** [/home/acme/git/perf/tools/build/Makefile.build:97: /tmp/build/perf/pmu-events/pmu-events.o] Error 1
> make[2]: *** [Makefile.perf:676: /tmp/build/perf/pmu-events/pmu-events-in.o] Error 2
> make[2]: *** Waiting for unfinished jobs....
> CC /tmp/build/perf/builtin-buildid-cache.o
>
> <SNIP>
>
> CC /tmp/build/perf/tests/attr.o
> arch/arm64/util/pmu.c: In function ‘pmu_events_table__find’:
> arch/arm64/util/pmu.c:35:24: error: implicit declaration of function ‘perf_pmu__find_table’; did you mean ‘perf_pmu__find_by_type’? [-Werror=implicit-function-declaration]
> 35 | return perf_pmu__find_table(pmu);
> | ^~~~~~~~~~~~~~~~~~~~
> | perf_pmu__find_by_type
> arch/arm64/util/pmu.c:35:24: error: returning ‘int’ from a function with return type ‘const struct pmu_events_table *’ makes pointer from integer without a cast [-Werror=int-conversion]
> 35 | return perf_pmu__find_table(pmu);
> | ^~~~~~~~~~~~~~~~~~~~~~~~~
> cc1: all warnings being treated as errors
> make[6]: *** [/home/acme/git/perf/tools/build/Makefile.build:97: /tmp/build/perf/arch/arm64/util/pmu.o] Error 1
> make[5]: *** [/home/acme/git/perf/tools/build/Makefile.build:139: util] Error 2
> make[4]: *** [/home/acme/git/perf/tools/build/Makefile.build:139: arm64] Error 2
> make[3]: *** [/home/acme/git/perf/tools/build/Makefile.build:139: arch] Error 2
> make[3]: *** Waiting for unfinished jobs....
> CC /tmp/build/perf/tests/vmlinux-kallsyms.o
>
> -----
>
> I'm building with:

So:

acme@roc-rk3399-pc:~/git/perf$ find tools/perf/ -name "*.[ch]" | xargs grep -w perf_pmu__find_table
tools/perf/arch/arm64/util/pmu.c: return perf_pmu__find_table(pmu);
tools/perf/pmu-events/pmu-events.c:const struct pmu_events_table *perf_pmu__find_table(struct perf_pmu *pmu)
acme@roc-rk3399-pc:~/git/perf$
acme@roc-rk3399-pc:~/git/perf$ git log --oneline -1
d22e569cd33d (HEAD) perf pmu-events: Separate the metrics from events for no jevents
acme@roc-rk3399-pc:~/git/perf$

Tring to fix...

>
> acme@roc-rk3399-pc:~/git/perf$ alias m
> alias m='make -k BUILD_BPF_SKEL=1 CORESIGHT=1 O=/tmp/build/perf -C tools/perf install-bin && git status && perf test python'
> acme@roc-rk3399-pc:~/git/perf$ rm -rf /tmp/build/$(basename $(pwd)) ; mkdir -p /tmp/build/$(basename $(pwd)) ; m

>
> To then go back to:
>
> > pmu-events/pmu-events.c:3616:11: error: ‘struct pmu_event’ has no member named ‘metric_expr’
>

--

- Arnaldo