[2.6.18-rc4-mm2] Compile error in afs

From: Antonino A. Daplas
Date: Tue Aug 22 2006 - 05:22:46 EST

With CONFIG_AFS_FSCACHE=n, I get this compile error:

fs/afs/file.c: In function âafs_file_releasepageâ:
fs/afs/file.c:332: error: âstruct afs_vnodeâ has no member named âcacheâ
make[2]: *** [fs/afs/file.o] Error 1
make[1]: *** [fs/afs] Error 2
make: *** [fs] Error 2


To unsubscribe from this list: send the line "unsubscribe linux-kernel" in
the body of a message to majordomo@xxxxxxxxxxxxxxx
More majordomo info at http://vger.kernel.org/majordomo-info.html
Please read the FAQ at http://www.tux.org/lkml/