Re: 2.4.21-rc8-laptop1 released

From: Kevin Fenzi (
Date: Fri Jun 13 2003 - 10:51:30 EST

Hash: SHA1

>>>>> "Zsolt" == Zsolt Babak <> writes:

Zsolt> Hi! This has nothing to do with the laptop patch, these
Zsolt> defines are really missing from include/linux/pci_ids.h.

ah... so I see.

Zsolt> In -rc5 I just removed the line from the .c file that
Zsolt> referenced the missing ID, and it works very well...

Zsolt> Maybe this is a bug ;)

Yeah, looks like, or something that wasn't entirely merged.
Commenting those out gets me further, but then it fails in:

ld -m elf_i386 -r -o cpqphp.o cpqphp_core.o cpqphp_ctrl.o cpqphp_proc.o cpqphp_pci.o
gcc -D__KERNEL__ -I/usr/src/redhat/BUILD/kernel-2.4.21rc8laptop1/include -Wall -Wstrict-prototypes -Wno-trigraphs -O2 -fno-strict-aliasing -fno-common -fomit-frame-pointer -pipe -mpreferred-stack-boundary=2 -march=pentium4 -DMODULE -DMODVERSIONS -include /usr/src/redhat/BUILD/kernel-2.4.21rc8laptop1/include/linux/modversions.h -nostdinc -iwithprefix include -DKBUILD_BASENAME=acpiphp_core -c -o acpiphp_core.o acpiphp_core.c
gcc -D__KERNEL__ -I/usr/src/redhat/BUILD/kernel-2.4.21rc8laptop1/include -Wall -Wstrict-prototypes -Wno-trigraphs -O2 -fno-strict-aliasing -fno-common -fomit-frame-pointer -pipe -mpreferred-stack-boundary=2 -march=pentium4 -DMODULE -DMODVERSIONS -include /usr/src/redhat/BUILD/kernel-2.4.21rc8laptop1/include/linux/modversions.h -nostdinc -iwithprefix include -DKBUILD_BASENAME=acpiphp_glue -c -o acpiphp_glue.o acpiphp_glue.c
acpiphp_glue.c: In function `find_host_bridge':
acpiphp_glue.c:815: warning: passing arg 2 of `acpi_get_object_info_R4d2dc830' from incompatible pointer type
acpiphp_glue.c:821: subscripted value is neither array nor pointer
acpiphp_glue.c:826: incompatible type for argument 1 of `strcmp'
make[3]: *** [acpiphp_glue.o] Error 1
make[3]: Leaving directory `/usr/src/redhat/BUILD/kernel-2.4.21rc8laptop1/drivers/hotplug'
make[2]: *** [_modsubdir_hotplug] Error 2
make[2]: Leaving directory `/usr/src/redhat/BUILD/kernel-2.4.21rc8laptop1/drivers'
make[1]: *** [_mod_drivers] Error 2
make[1]: Leaving directory `/usr/src/redhat/BUILD/kernel-2.4.21rc8laptop1'
error: Bad exit status from /var/tmp/rpm-tmp.58636 (%build)

Something related to the i830 stuff someone else reported problems

Zsolt> Zod.

Version: GnuPG v1.2.1 (GNU/Linux)
Comment: Processed by Mailcrypt 3.5.8 <>


To unsubscribe from this list: send the line "unsubscribe linux-kernel" in
the body of a message to
More majordomo info at
Please read the FAQ at

This archive was generated by hypermail 2b29 : Sun Jun 15 2003 - 22:00:37 EST