problems build usb-serial as a module in 2.5.51

From: Ed Tomlinson (
Date: Tue Dec 10 2002 - 21:09:18 EST

I get this building 2.5.51

make -f scripts/ obj=drivers/usb/serial
  gcc -Wp,-MD,drivers/usb/serial/.usb-serial.o.d -D__KERNEL__ -Iinclude -Wall -Wstrict-prototypes -Wno-trigraphs -O2 -fno-strict-aliasing -fno-common -pipe -mpreferred-stack-boundary=2 -march=k6 -Iarch/i386/mach-generic -nostdinc -iwithprefix include -DMODULE -DKBUILD_BASENAME=usb_serial -DKBUILD_MODNAME=usbserial -DEXPORT_SYMTAB -c -o drivers/usb/serial/usb-serial.o drivers/usb/serial/usb-serial.c
{standard input}: Assembler messages:
{standard input}:2592: Error: value of -129 too large for field of 1 bytes at 5820
make[3]: *** [drivers/usb/serial/usb-serial.o] Error 1
make[2]: *** [drivers/usb/serial] Error 2
make[1]: *** [drivers/usb] Error 2
make: *** [drivers] Error 2
You have new mail.

Ed Tomlinson

To unsubscribe from this list: send the line "unsubscribe linux-kernel" in
the body of a message to
More majordomo info at
Please read the FAQ at

This archive was generated by hypermail 2b29 : Sun Dec 15 2002 - 22:00:19 EST