Problems compiling 2.4.7 with DAC960

From: Arnvid Karstad (
Date: Mon Jul 30 2001 - 00:48:19 EST


I can't seem to be getting 2.4.7 to compile on one of our boxes.
I get this error:

gcc -D__KERNEL__ -I/usr/src/linux-2.4.7/include -Wall -Wstrict-prototypes -Wno-trigraphs -O2 -fomit-frame-pointer -fno-strict-aliasing -fno-common -pipe -mpreferred-stack-boundary=2 -march=i686 -DEXPORT_SYMTAB -c DAC960.c
DAC960.c: In function `DAC960_ProcessRequest':
DAC960.c:2771: structure has no member named `sem'
make[3]: *** [DAC960.o] Error 1
make[3]: Leaving directory `/usr/src/linux-2.4.7/drivers/block'
make[2]: *** [first_rule] Error 2
make[2]: Leaving directory `/usr/src/linux-2.4.7/drivers/block'
make[1]: *** [_subdir_block] Error 2
make[1]: Leaving directory `/usr/src/linux-2.4.7/drivers'
make: *** [_dir_drivers] Error 2
[root@x linux]#

I get the same error when trying to compile it as a module..
Is it broken, or is something else broken?


Arnvid Karstad
To unsubscribe from this list: send the line "unsubscribe linux-kernel" in
the body of a message to
More majordomo info at
Please read the FAQ at

This archive was generated by hypermail 2b29 : Tue Jul 31 2001 - 21:00:42 EST