Another 2.4.7 build failure

From: Filip Van Raemdonck (
Date: Sat Jul 21 2001 - 15:28:26 EST

Building fails for me with following error:

make[4]: Entering directory
gcc -D__KERNEL__ -I/home/admin/mechanix/srcd/linux/linux/include -Wall -Wstrict-prototypes -Wno-trigraphs -O2 -fomit-frame-pointer -fno-strict-aliasing -fno-common -pipe -mpreferred-stack-boundary=2 -march=i586 -DEXPORT_SYMTAB -c ll_rw_blk.c
ll_rw_blk.c:25: linux/completion.h: No such file or directory
ll_rw_blk.c: In function `attempt_merge':
ll_rw_blk.c:630: structure has no member named `waiting'
ll_rw_blk.c: In function `__make_request':
ll_rw_blk.c:815: structure has no member named `waiting'
ll_rw_blk.c: In function `ll_rw_block':
ll_rw_blk.c:1051: `end_buffer_io_sync' undeclared (first use in this function)
ll_rw_blk.c:1051: (Each undeclared identifier is reported only once
ll_rw_blk.c:1051: for each function it appears in.)
ll_rw_blk.c: In function `end_that_request_last':
ll_rw_blk.c:1144: structure has no member named `waiting'
ll_rw_blk.c:1145: warning: implicit declaration of function `complete'
ll_rw_blk.c:1145: structure has no member named `waiting'
make[4]: *** [ll_rw_blk.o] Error 1
make[4]: Leaving directory `/home/admin/mechanix/srcd/linux/linux/drivers/block'
make[3]: *** [first_rule] Error 2
make[3]: Leaving directory `/home/admin/mechanix/srcd/linux/linux/drivers/block'
make[2]: *** [_subdir_block] Error 2
make[2]: Leaving directory `/home/admin/mechanix/srcd/linux/linux/drivers'
make[1]: *** [_dir_drivers] Error 2
make[1]: Leaving directory `/home/admin/mechanix/srcd/linux/linux'
make: *** [stamp-build] Error 2



"The only stupid question is the unasked one."
	-- Martin Schulze

- To unsubscribe from this list: send the line "unsubscribe linux-kernel" in the body of a message to More majordomo info at Please read the FAQ at

This archive was generated by hypermail 2b29 : Mon Jul 23 2001 - 21:00:15 EST